Queue | Packages | Commits

Pending builds

# aport pkgver branch arch commit sr.ht id status
3780 zmqpp 4.2.0-0 master x86_64 d0f5d25e - WAITING
3779 zeitgeist 1.0.1-0 master x86_64 d0f5d25e - WAITING
3778 xcursorgen 1.0.6-0 master x86_64 d0f5d25e - WAITING
3777 wcnss-wlan 1-1 master x86_64 d0f5d25e - WAITING
3776 watchdog-kick 0.1-0 master x86_64 d0f5d25e - WAITING
3775 vvave 0_git20190105-0 master x86_64 d0f5d25e - WAITING
3774 uuu 1.2.91-0 master x86_64 d0f5d25e - WAITING
3773 url-dispatcher 0_git20181007-0 master x86_64 d0f5d25e - WAITING
3772 unixbench 5.1.3_git20180129-0 master x86_64 d0f5d25e - WAITING
3771 unity8 0_git20181011-0 master x86_64 d0f5d25e - WAITING
3770 unity7-schemas 1-0 master x86_64 d0f5d25e - WAITING
3769 unity-system-compositor 0_git20180219-1 master x86_64 d0f5d25e - WAITING
3768 unity-api 0_git20190211-0 master x86_64 d0f5d25e - WAITING
3767 unicsy-demo 0.4.6-0 master x86_64 d0f5d25e - WAITING
3766 umockdev 0.12.1-0 master x86_64 d0f5d25e - WAITING
3765 ubuntu-ui-toolkit 0_git20190208-0 master x86_64 d0f5d25e - WAITING
3764 ubuntu-download-manager 0_git20181003-1 master x86_64 d0f5d25e - WAITING
3763 ubuntu-app-launch 0_git20181230-0 master x86_64 d0f5d25e - WAITING
3762 trust-store 0_git20180614-1 master x86_64 d0f5d25e - WAITING
3761 triggerhappy 0.5.0-0 master x86_64 d0f5d25e - WAITING
3760 threadweaver 5.57.0-0 master x86_64 d0f5d25e - WAITING
3759 telepathy-qt5 0.9.7-0 master x86_64 d0f5d25e - WAITING
3758 telepathy-ofono 0.2-0 master x86_64 d0f5d25e - WAITING
3757 telepathy-mission-control 5.16.4-0 master x86_64 d0f5d25e - WAITING
3756 telepathy-glib 0.24.1-1 master x86_64 d0f5d25e - WAITING
3755 telepathy-farstream 0.6.2-0 master x86_64 d0f5d25e - WAITING
3754 system-settings 0_git20181011-0 master x86_64 d0f5d25e - WAITING
3753 syntax-highlighting 5.57.0-0 master x86_64 d0f5d25e - WAITING
3752 sonnet 5.57.0-0 master x86_64 d0f5d25e - WAITING
3751 solid 5.57.0-0 master x86_64 d0f5d25e - WAITING
3750 sink 0.7.0-2 master x86_64 d0f5d25e - WAITING
3749 settings-components 0_git20180610-0 master x86_64 d0f5d25e - WAITING
3748 sdl_net 1.2.8-0 master x86_64 d0f5d25e - WAITING
3747 sapwood 3.1.1-1 master x86_64 d0f5d25e - WAITING
3746 rpmsgexport 0.0_git20180228-0 master x86_64 d0f5d25e - WAITING
3745 qxmpp 1.0.0-0 master x86_64 d0f5d25e - WAITING
3744 qtwebbrowser 1.0-0 master x86_64 d0f5d25e 57565 BUILDING

Completed builds

# aport pkgver branch arch time commit sr.ht id status
3743 qtmir 0_git20190222-0 master x86_64 0h 00m 00s d0f5d25e 57564 FAILED
3742 qt5ct 0.37-0 master x86_64 0h 01m 52s d0f5d25e 57563 DONE
3741 qt5-qtsystems 0_git20190103-0 master x86_64 0h 00m 00s d0f5d25e 57562 FAILED
3740 qt5-qtpim 0_git20190227-0 master x86_64 0h 00m 00s d0f5d25e 57561 FAILED
3739 qt5-qtfeedback 0_git20180903-0 master x86_64 0h 00m 00s d0f5d25e 57560 FAILED
3738 qt5-qtdeclarative 9999-5 master x86_64 0h 43m 37s d0f5d25e 57547 DONE
3737 qt5-qtbase 9999-12 master x86_64 1h 17m 25s d0f5d25e 57544 DONE
3736 qrtr 1.0_git20180131-1 master x86_64 0h 00m 33s d0f5d25e 57543 DONE
3735 qmltermwidget 0.2.0-0 master x86_64 0h 02m 09s d0f5d25e 57542 DONE
3734 qmlkonsole 0_git20190105-0 master x86_64 0h 00m 00s d0f5d25e 57541 FAILED
3733 qmenumodel 0_git20180727-0 master x86_64 0h 01m 32s d0f5d25e 57540 DONE
3732 qemu 9999-0 master x86_64 0h 00m 00s d0f5d25e 57539 FAILED
3731 qdjango 0.6.2-0 master x86_64 0h 01m 32s d0f5d25e 57538 DONE
3730 qcom_rmtfs 0.0_git20180131-3 master x86_64 0h 00m 00s d0f5d25e 57537 FAILED
3729 py3-httpbin 0.7.0-0 master x86_64 0h 00m 40s d0f5d25e 57536 DONE
3728 py3-dbusmock 0.18-0 master x86_64 0h 00m 40s d0f5d25e 57535 DONE
3727 py3-brotlipy 0.7.0-1 master x86_64 0h 01m 04s d0f5d25e 57534 DONE
3726 py-rdflib 4.2.2-0 master x86_64 0h 00m 42s d0f5d25e 57533 DONE
3725 py-isodate 0.6.0-0 master x86_64 0h 00m 37s d0f5d25e 57532 DONE
3724 properties-cpp 0.0.1-0 master x86_64 0h 00m 45s d0f5d25e 57531 DONE
3723 profiled 1.0.6-0 master x86_64 0h 00m 42s d0f5d25e 57530 DONE
3722 process-cpp 2.0.1-1 master x86_64 0h 00m 00s d0f5d25e 57529 FAILED
3721 prison 5.57.0-0 master x86_64 0h 00m 00s d0f5d25e 57528 FAILED
3720 powerdevil 5.15.4-1 master x86_64 0h 00m 00s d0f5d25e 57527 FAILED
3719 postmarketos-update-kernel 0.0.3-0 master x86_64 0h 00m 41s d0f5d25e 57526 DONE
3718 postmarketos-ui-xfce4 0.2-5 master x86_64 0h 00m 00s d0f5d25e 57525 FAILED
3717 postmarketos-ui-weston 4-7 master x86_64 0h 00m 00s d0f5d25e 57524 FAILED
3716 postmarketos-ui-plasma-mobile-extras 1-0 master x86_64 0h 00m 00s d0f5d25e 57521 FAILED
3715 postmarketos-ui-plasma-mobile 1-28 master x86_64 0h 00m 00s d0f5d25e 57520 FAILED
3714 postmarketos-ui-mate 1-5 master x86_64 0h 00m 00s d0f5d25e 57519 FAILED
3713 postmarketos-ui-matchbox 1-3 master x86_64 0h 00m 00s d0f5d25e 57518 FAILED
3712 postmarketos-ui-i3wm 0.3-1 master x86_64 0h 00m 37s d0f5d25e 57517 DONE
3711 postmarketos-ui-hildon 1-6 master x86_64 0h 00m 00s d0f5d25e 57516 FAILED
3710 postmarketos-splash 2-0 master x86_64 0h 00m 38s d0f5d25e 57515 DONE
3709 postmarketos-mkinitfs-hook-verbose-initfs 0.1.0-0 master x86_64 0h 00m 00s d0f5d25e 57514 FAILED
3708 postmarketos-mkinitfs-hook-maximum-attention 0.1.0-0 master x86_64 0h 00m 00s d0f5d25e 57513 FAILED
3707 postmarketos-mkinitfs-hook-kernel-panic 0.1.0-0 master x86_64 0h 00m 00s d0f5d25e 57512 FAILED
3706 postmarketos-mkinitfs-hook-debug-shell 0.1.1-3 master x86_64 0h 00m 00s d0f5d25e 57511 FAILED
3705 postmarketos-mkinitfs 0.7.6-0 master x86_64 0h 00m 00s d0f5d25e 57510 FAILED
3704 postmarketos-demos 6-0 master x86_64 0h 00m 44s d0f5d25e 57509 DONE
3703 postmarketos-base 3-24 master x86_64 0h 00m 00s d0f5d25e 57508 FAILED
3702 postmarketos-artwork-wallpapers 1-5 master x86_64 0h 00m 41s d0f5d25e 57507 DONE
3701 postmarketos-artwork 1-0 master x86_64 0h 00m 00s d0f5d25e 57506 FAILED
3700 postmarketos-android-recovery-installer 0.1.10-1 master x86_64 0h 00m 31s d0f5d25e 57505 DONE
3699 polkit-qt 0.112.0_git20160416-0 master x86_64 0h 01m 23s d0f5d25e 57504 DONE
3698 polkit-kde-agent 5.15.4-0 master x86_64 0h 00m 00s d0f5d25e 57503 FAILED
3697 pmbootstrap 1.5.1-0 master x86_64 0h 00m 38s d0f5d25e 57502 DONE
3696 platform-api 0_git20180218-0 master x86_64 0h 00m 00s d0f5d25e 57501 FAILED
3695 plasma-workspace 5.15.4-1 master x86_64 0h 00m 00s d0f5d25e 57500 FAILED
3694 plasma-videoplayer 0_git20190403-0 master x86_64 0h 00m 00s d0f5d25e 57499 FAILED